Target
CREB-binding protein
Ligand
BDBM50430830
Substrate
Meas. Tech.
ChEMBL_944373 (CHEMBL2344877)
IC50
2810±n/a nM
Citation
 Hewings, DSFedorov, OFilippakopoulos, PMartin, SPicaud, STumber, AWells, COlcina, MMFreeman, KGill, ARitchie, AJSheppard, DWRussell, AJHammond, EMKnapp, SBrennan, PEConway, SJ Optimization of 3,5-dimethylisoxazole derivatives as potent bromodomain ligands. J Med Chem 56:3217-27 (2013)  
Target
Name:
CREB-binding protein
Synonyms:
CBP CREB-binding protein (CBP) CREBBP
Type:
Transcription Coactivator
Mol. Mass.:
265411.66
Organism:
Homo sapiens (Human)
Description:
Q92793
Residue:
2442
  
Inhibitor
Name:
BDBM50430830
Synonyms:
CHEMBL2335145
Type:
Small organic molecule
Emp. Form.:
C20H21NO4
Mol. Mass.:
339.385
SMILES:
Cc1noc(C)c1-c1cc(OCCO)cc(c1)C(O)c1ccccc1
: