Target
CREB-binding protein
Ligand
BDBM50430831
Substrate
Meas. Tech.
ChEMBL_944373 (CHEMBL2344877)
IC50
8500±n/a nM
Citation
 Hewings, DSFedorov, OFilippakopoulos, PMartin, SPicaud, STumber, AWells, COlcina, MMFreeman, KGill, ARitchie, AJSheppard, DWRussell, AJHammond, EMKnapp, SBrennan, PEConway, SJ Optimization of 3,5-dimethylisoxazole derivatives as potent bromodomain ligands. J Med Chem 56:3217-27 (2013)  
Target
Name:
CREB-binding protein
Synonyms:
CBP CREB-binding protein (CBP) CREBBP
Type:
Transcription Coactivator
Mol. Mass.:
265411.66
Organism:
Homo sapiens (Human)
Description:
Q92793
Residue:
2442
  
Inhibitor
Name:
BDBM50430831
Synonyms:
CHEMBL2335148
Type:
Small organic molecule
Emp. Form.:
C20H20ClNO3
Mol. Mass.:
357.831
SMILES:
CCOc1cc(cc(c1)-c1c(C)noc1C)C(O)c1cccc(Cl)c1
: