Target
Bromodomain-containing protein 4
Ligand
BDBM50430838
Substrate
Meas. Tech.
ChEMBL_944376 (CHEMBL2344880)
IC50
544±n/a nM
Citation
 Hewings, DSFedorov, OFilippakopoulos, PMartin, SPicaud, STumber, AWells, COlcina, MMFreeman, KGill, ARitchie, AJSheppard, DWRussell, AJHammond, EMKnapp, SBrennan, PEConway, SJ Optimization of 3,5-dimethylisoxazole derivatives as potent bromodomain ligands. J Med Chem 56:3217-27 (2013)  
Target
Name:
Bromodomain-containing protein 4
Synonyms:
BRD4 Bromodomain-containing protein 4 (BRD4) Protein HUNK1
Type:
Protein
Mol. Mass.:
152264.84
Organism:
Homo sapiens (Human)
Description:
O60885
Residue:
1362
  
Inhibitor
Name:
BDBM50430838
Synonyms:
CHEMBL2335146
Type:
Small organic molecule
Emp. Form.:
C18H15NO3
Mol. Mass.:
293.3166
SMILES:
Cc1noc(C)c1-c1cc(O)cc(c1)C(=O)c1ccccc1
: