Target
Bromodomain-containing protein 4
Ligand
BDBM50430834
Substrate
Meas. Tech.
ChEMBL_944376 (CHEMBL2344880)
IC50
1500±n/a nM
Citation
 Hewings, DSFedorov, OFilippakopoulos, PMartin, SPicaud, STumber, AWells, COlcina, MMFreeman, KGill, ARitchie, AJSheppard, DWRussell, AJHammond, EMKnapp, SBrennan, PEConway, SJ Optimization of 3,5-dimethylisoxazole derivatives as potent bromodomain ligands. J Med Chem 56:3217-27 (2013)  
Target
Name:
Bromodomain-containing protein 4
Synonyms:
BRD4 Bromodomain-containing protein 4 (BRD4) Protein HUNK1
Type:
Protein
Mol. Mass.:
152264.84
Organism:
Homo sapiens (Human)
Description:
O60885
Residue:
1362
  
Inhibitor
Name:
BDBM50430834
Synonyms:
CHEMBL2335151
Type:
Small organic molecule
Emp. Form.:
C20H20FNO3
Mol. Mass.:
341.3761
SMILES:
CCOc1cc(cc(c1)-c1c(C)noc1C)C(O)c1ccc(F)cc1
: