Target
Alpha-ketoglutarate-dependent dioxygenase FTO
Ligand
BDBM50371704
Substrate
Meas. Tech.
ChEMBL_947323 (CHEMBL2344107)
IC50
11000±n/a nM
Citation
 Aik, WDemetriades, MHamdan, MKBagg, EAYeoh, KKLejeune, CZhang, ZMcDonough, MASchofield, CJ Structural basis for inhibition of the fat mass and obesity associated protein (FTO). J Med Chem 56:3680-8 (2013)  
Target
Name:
Alpha-ketoglutarate-dependent dioxygenase FTO
Synonyms:
FTO Fat mass and obesity-associated protein | KIAA1752
Type:
PROTEIN
Mol. Mass.:
58263.75
Organism:
Homo sapiens (Human)
Description:
ChEMBL_1515854
Residue:
505
  
Inhibitor
Name:
BDBM50371704
Synonyms:
CHEMBL270415
Type:
Small organic molecule
Emp. Form.:
C14H7BrNO5S
Mol. Mass.:
381.179
SMILES:
Nc1c2C(=O)c3ccccc3C(=O)c2c(Br)cc1S([O-])(=O)=O
: