Target
D-amino-acid oxidase
Ligand
BDBM50431070
Substrate
Meas. Tech.
ChEMBL_947854 (CHEMBL2343130)
IC50
6.5±n/a nM
Citation
 Hondo, TWarizaya, MNiimi, TNamatame, IYamaguchi, TNakanishi, KHamajima, THarada, KSakashita, HMatsumoto, YOrita, MTakeuchi, M 4-Hydroxypyridazin-3(2H)-one derivatives as novel D-amino acid oxidase inhibitors. J Med Chem 56:3582-92 (2013)  
Target
Name:
D-amino-acid oxidase
Synonyms:
D-Amino Acid Oxidase (DAAO) Dao OXDA_RAT
Type:
Homodimer
Mol. Mass.:
38824.91
Organism:
Rattus norvegicus (rat)
Description:
Recombinant rat DAAO expressed and purified from sf9 insect cells, was used in enzyme assays.
Residue:
346
  
Inhibitor
Name:
BDBM50431070
Synonyms:
CHEMBL2338794
Type:
Small organic molecule
Emp. Form.:
C11H10N2O3
Mol. Mass.:
218.2087
SMILES:
Oc1cc(COc2ccccc2)n[nH]c1=O
: