Target
Orexin/Hypocretin receptor type 1
Ligand
BDBM50431850
Substrate
Meas. Tech.
ChEMBL_952752 (CHEMBL2350731)
IC50
344±n/a nM
Citation
 Sifferlen, TKoberstein, RCottreel, EBoller, AWeller, TGatfield, JBrisbare-Roch, CJenck, FBoss, C Synthesis, structure-activity relationship studies, and identification of novel 5,6,7,8-tetrahydroimidazo[1,5-a]pyrazine derivatives as dual orexin receptor antagonists. Part 1. Bioorg Med Chem Lett 23:2212-6 (2013)  
Target
Name:
Orexin/Hypocretin receptor type 1
Synonyms:
HCRTR1 OX1R_HUMAN Orexin receptor type 1 (OR 1) Orexin receptor type 1 (OX1) Orexin receptor type 1 (OxR1) | Ox1r
Type:
Protein
Mol. Mass.:
47554.50
Organism:
Homo sapiens (Human)
Description:
O43613
Residue:
425
  
Inhibitor
Name:
BDBM50431850
Synonyms:
CHEMBL2347602
Type:
Small organic molecule
Emp. Form.:
C29H34F3N5O2
Mol. Mass.:
541.6078
SMILES:
CCc1nc(C(=O)N(C)C)c2C(CCc3ccc(cc3)C(F)(F)F)N(CCn12)[C@@H](C(=O)NC)c1ccccc1
: