Target
Orexin/Hypocretin receptor type 1
Ligand
BDBM50431856
Substrate
Meas. Tech.
ChEMBL_952752 (CHEMBL2350731)
IC50
3980±n/a nM
Citation
 Sifferlen, TKoberstein, RCottreel, EBoller, AWeller, TGatfield, JBrisbare-Roch, CJenck, FBoss, C Synthesis, structure-activity relationship studies, and identification of novel 5,6,7,8-tetrahydroimidazo[1,5-a]pyrazine derivatives as dual orexin receptor antagonists. Part 1. Bioorg Med Chem Lett 23:2212-6 (2013)  
Target
Name:
Orexin/Hypocretin receptor type 1
Synonyms:
HCRTR1 OX1R_HUMAN Orexin receptor type 1 (OR 1) Orexin receptor type 1 (OX1) Orexin receptor type 1 (OxR1) | Ox1r
Type:
Protein
Mol. Mass.:
47554.50
Organism:
Homo sapiens (Human)
Description:
O43613
Residue:
425
  
Inhibitor
Name:
BDBM50431856
Synonyms:
CHEMBL2347486
Type:
Small organic molecule
Emp. Form.:
C28H33F3N4O2
Mol. Mass.:
514.5824
SMILES:
CCOc1nc(CC)n2CCN([C@@H](C(=O)NC)c3ccccc3)C(CCc3ccc(cc3)C(F)(F)F)c12
: