Target
Orexin receptor type 2
Ligand
BDBM50431862
Substrate
Meas. Tech.
ChEMBL_952751 (CHEMBL2350730)
IC50
23±n/a nM
Citation
 Sifferlen, TKoberstein, RCottreel, EBoller, AWeller, TGatfield, JBrisbare-Roch, CJenck, FBoss, C Synthesis, structure-activity relationship studies, and identification of novel 5,6,7,8-tetrahydroimidazo[1,5-a]pyrazine derivatives as dual orexin receptor antagonists. Part 1. Bioorg Med Chem Lett 23:2212-6 (2013)  
Target
Name:
Orexin receptor type 2
Synonyms:
HCRTR2 OX2R_HUMAN Orexin receptor type 2 (OR-2) Orexin receptor type 2 (OX2R) Ox-2-R | Ox2-R
Type:
Protein
Mol. Mass.:
50710.53
Organism:
Homo sapiens (Human)
Description:
O43614
Residue:
444
  
Inhibitor
Name:
BDBM50431862
Synonyms:
CHEMBL2347480
Type:
Small organic molecule
Emp. Form.:
C28H31F3N4O
Mol. Mass.:
496.5671
SMILES:
CCc1nc(C=C)c2C(CCc3ccc(cc3)C(F)(F)F)N(CCn12)[C@@H](C(=O)NC)c1ccccc1
: