Target
Plasmepsin II
Ligand
BDBM50432238
Substrate
Meas. Tech.
ChEMBL_950960 (CHEMBL2350286)
IC50
6450±n/a nM
Citation
 Song, YJin, HLiu, XZhu, LHuang, JLi, H Discovery of non-peptide inhibitors of Plasmepsin II by structure-based virtual screening. Bioorg Med Chem Lett 23:2078-82 (2013)  
Target
Name:
Plasmepsin II
Synonyms:
Aspartic hemoglobinase II PLM2_PLAFX Plasmepsin 2 Plasmepsin-II
Type:
Enzyme
Mol. Mass.:
51482.09
Organism:
Plasmodium falciparum
Description:
P46925
Residue:
453
  
Inhibitor
Name:
BDBM50432238
Synonyms:
CHEMBL2347357
Type:
Small organic molecule
Emp. Form.:
C23H18ClN5S
Mol. Mass.:
431.941
SMILES:
NC(=S)NNC(=Cc1nc(cc2ccccc12)-c1ccccn1)c1ccc(Cl)cc1
: