Target
Prostaglandin G/H synthase 1
Ligand
BDBM50432278
Substrate
Meas. Tech.
ChEMBL_951244 (CHEMBL2353245)
IC50
360±n/a nM
Citation
 Assadieskandar, AAmirhamzeh, ASalehi, MOzadali, KOstad, SNShafiee, AAmini, M Synthesis, cyclooxygenase inhibitory effects, and molecular modeling study of 4-aryl-5-(4-(methylsulfonyl)phenyl)-2-alkylthio and -2-alkylsulfonyl-1H-imidazole derivatives. Bioorg Med Chem 21:2355-62 (2013)  
Target
Name:
Prostaglandin G/H synthase 1
Synonyms:
COX-1 Cyclooxygenase Cyclooxygenase-1 (COX-1) PTGS1 | Prostaglandin G/H synthase (cyclooxygenase)
Type:
Enzyme
Mol. Mass.:
68692.62
Organism:
Homo sapiens (Human)
Description:
P23219
Residue:
599
  
Inhibitor
Name:
BDBM50432278
Synonyms:
CHEMBL2347674
Type:
Small organic molecule
Emp. Form.:
C18H18N2O4S2
Mol. Mass.:
390.477
SMILES:
CCS(=O)(=O)c1nc(c([nH]1)-c1ccc(cc1)S(C)(=O)=O)-c1ccccc1
: