Target
Prostaglandin G/H synthase 1
Ligand
BDBM50432283
Substrate
Meas. Tech.
ChEMBL_951244 (CHEMBL2353245)
IC50
390±n/a nM
Citation
 Assadieskandar, AAmirhamzeh, ASalehi, MOzadali, KOstad, SNShafiee, AAmini, M Synthesis, cyclooxygenase inhibitory effects, and molecular modeling study of 4-aryl-5-(4-(methylsulfonyl)phenyl)-2-alkylthio and -2-alkylsulfonyl-1H-imidazole derivatives. Bioorg Med Chem 21:2355-62 (2013)  
Target
Name:
Prostaglandin G/H synthase 1
Synonyms:
COX-1 Cyclooxygenase Cyclooxygenase-1 (COX-1) PTGS1 | Prostaglandin G/H synthase (cyclooxygenase)
Type:
Enzyme
Mol. Mass.:
68692.62
Organism:
Homo sapiens (Human)
Description:
P23219
Residue:
599
  
Inhibitor
Name:
BDBM50432283
Synonyms:
CHEMBL2346675
Type:
Small organic molecule
Emp. Form.:
C17H15FN2O4S2
Mol. Mass.:
394.44
SMILES:
CS(=O)(=O)c1nc(c([nH]1)-c1ccc(cc1)S(C)(=O)=O)-c1ccc(F)cc1
: