Target
Cholinesterase
Ligand
BDBM50433006
Substrate
Meas. Tech.
ChEMBL_955710 (CHEMBL2379021)
IC50
17100±n/a nM
Citation
 He, YYao, PFChen, SBHuang, ZHHuang, SLTan, JHLi, DGu, LQHuang, ZS Synthesis and evaluation of 7,8-dehydrorutaecarpine derivatives as potential multifunctional agents for the treatment of Alzheimer's disease. Eur J Med Chem 63:299-312 (2013)  
Target
Name:
Cholinesterase
Synonyms:
BCHE CHLE_HORSE | Cholinesterase
Type:
Enzyme
Mol. Mass.:
65643.35
Organism:
Equus caballus (Horse)
Description:
P81908
Residue:
574
  
Inhibitor
Name:
BDBM50433006
Synonyms:
CHEMBL2375935
Type:
Small organic molecule
Emp. Form.:
C26H26N5O2
Mol. Mass.:
440.5164
SMILES:
C[N+]1(CCC(=O)Nc2ccc3nc4c5[nH]c6ccccc6c5ccn4c(=O)c3c2)CCCC1
: