Target
Cholinesterase
Ligand
BDBM50433014
Substrate
Meas. Tech.
ChEMBL_955710 (CHEMBL2379021)
IC50
14900±n/a nM
Citation
 He, YYao, PFChen, SBHuang, ZHHuang, SLTan, JHLi, DGu, LQHuang, ZS Synthesis and evaluation of 7,8-dehydrorutaecarpine derivatives as potential multifunctional agents for the treatment of Alzheimer's disease. Eur J Med Chem 63:299-312 (2013)  
Target
Name:
Cholinesterase
Synonyms:
BCHE CHLE_HORSE | Cholinesterase
Type:
Enzyme
Mol. Mass.:
65643.35
Organism:
Equus caballus (Horse)
Description:
P81908
Residue:
574
  
Inhibitor
Name:
BDBM50433014
Synonyms:
CHEMBL2375927
Type:
Small organic molecule
Emp. Form.:
C25H23N5O2
Mol. Mass.:
425.4824
SMILES:
O=C(CCN1CCCC1)Nc1ccc2nc3c4[nH]c5ccccc5c4ccn3c(=O)c2c1
: