Target
Cholinesterase
Ligand
BDBM50316369
Substrate
Meas. Tech.
ChEMBL_955710 (CHEMBL2379021)
IC50
23200±n/a nM
Citation
 He, YYao, PFChen, SBHuang, ZHHuang, SLTan, JHLi, DGu, LQHuang, ZS Synthesis and evaluation of 7,8-dehydrorutaecarpine derivatives as potential multifunctional agents for the treatment of Alzheimer's disease. Eur J Med Chem 63:299-312 (2013)  
Target
Name:
Cholinesterase
Synonyms:
BCHE CHLE_HORSE | Cholinesterase
Type:
Enzyme
Mol. Mass.:
65643.35
Organism:
Equus caballus (Horse)
Description:
P81908
Residue:
574
  
Inhibitor
Name:
BDBM50316369
Synonyms:
3-(2-N-Piperidyl-acetamino)-7,8-dehydrorutaecarpine | CHEMBL1098308
Type:
Small organic molecule
Emp. Form.:
C25H23N5O2
Mol. Mass.:
425.4824
SMILES:
O=C(CN1CCCCC1)Nc1ccc2nc3c4[nH]c5ccccc5c4ccn3c(=O)c2c1
: