Target
Cholinesterase
Ligand
BDBM50433026
Substrate
Meas. Tech.
ChEMBL_955710 (CHEMBL2379021)
IC50
7340±n/a nM
Citation
 He, YYao, PFChen, SBHuang, ZHHuang, SLTan, JHLi, DGu, LQHuang, ZS Synthesis and evaluation of 7,8-dehydrorutaecarpine derivatives as potential multifunctional agents for the treatment of Alzheimer's disease. Eur J Med Chem 63:299-312 (2013)  
Target
Name:
Cholinesterase
Synonyms:
BCHE CHLE_HORSE | Cholinesterase
Type:
Enzyme
Mol. Mass.:
65643.35
Organism:
Equus caballus (Horse)
Description:
P81908
Residue:
574
  
Inhibitor
Name:
BDBM50433026
Synonyms:
CHEMBL2375942
Type:
Small organic molecule
Emp. Form.:
C24H19N6O2
Mol. Mass.:
423.4461
SMILES:
Cn1cc[n+](CC(=O)Nc2ccc3nc4c5[nH]c6ccccc6c5ccn4c(=O)c3c2)c1
: