Target
Acetylcholinesterase
Ligand
BDBM50433023
Substrate
Meas. Tech.
ChEMBL_955711 (CHEMBL2379028)
IC50
158±n/a nM
Citation
 He, YYao, PFChen, SBHuang, ZHHuang, SLTan, JHLi, DGu, LQHuang, ZS Synthesis and evaluation of 7,8-dehydrorutaecarpine derivatives as potential multifunctional agents for the treatment of Alzheimer's disease. Eur J Med Chem 63:299-312 (2013)  
Target
Name:
Acetylcholinesterase
Synonyms:
ACES_ELEEL Acetylcholinesterase (EeAChE) | ache
Type:
Enzyme
Mol. Mass.:
71812.79
Organism:
Electrophorus electricus (Electric eel)
Description:
Residue:
633
  
Inhibitor
Name:
BDBM50433023
Synonyms:
CHEMBL2375945
Type:
Small organic molecule
Emp. Form.:
C25H24N6O2
Mol. Mass.:
440.4971
SMILES:
CN1CCN(CC(=O)Nc2ccc3nc4c5[nH]c6ccccc6c5ccn4c(=O)c3c2)CC1
: