Target
Tyrosine-protein kinase JAK2
Ligand
BDBM50433247
Substrate
Meas. Tech.
ChEMBL_957632 (CHEMBL2378515)
IC50
16±n/a nM
Citation
 Lynch, SMDeVicente, JHermann, JCJaime-Figueroa, SJin, SKuglstatter, ALi, HLovey, AMenke, JNiu, LPatel, VRoy, DSoth, MSteiner, STivitmahaisoon, PVu, MDYee, C Strategic use of conformational bias and structure based design to identify potent JAK3 inhibitors with improved selectivity against the JAK family and the kinome. Bioorg Med Chem Lett 23:2793-800 (2013)  
Target
Name:
Tyrosine-protein kinase JAK2
Synonyms:
JAK-2 JAK2_HUMAN Janus kinase 2 (JAK2) | Janus kinase 2 (a protein tyrosine kinase)
Type:
Protein
Mol. Mass.:
130684.68
Organism:
Homo sapiens (Human)
Description:
O60674
Residue:
1132
  
Inhibitor
Name:
BDBM50433247
Synonyms:
CHEMBL2376149
Type:
Small organic molecule
Emp. Form.:
C23H22N8O3
Mol. Mass.:
458.4726
SMILES:
COc1ccc2c(nn(C)c2c1)-c1cnc2[nH]cc(C(=O)N[C@H](C)C(=O)N3CC(C3)C#N)c2n1
: