Target
Cholinesterase
Ligand
BDBM50433313
Substrate
Meas. Tech.
ChEMBL_957891 (CHEMBL2377916)
Ki
1.7±n/a nM
Citation
 Chen, YSun, JHuang, ZLiao, HPeng, SLehmann, JZhang, Y Design, synthesis and evaluation of tacrine-flurbiprofen-nitrate trihybrids as novel anti-Alzheimer's disease agents. Bioorg Med Chem 21:2462-70 (2013)  
Target
Name:
Cholinesterase
Synonyms:
BCHE CHLE_HORSE | Cholinesterase
Type:
Enzyme
Mol. Mass.:
65643.35
Organism:
Equus caballus (Horse)
Description:
P81908
Residue:
574
  
Inhibitor
Name:
BDBM50433313
Synonyms:
CHEMBL2376474
Type:
Small organic molecule
Emp. Form.:
C36H41FN4O5
Mol. Mass.:
628.7329
SMILES:
CC(C(=O)NCCCCCCNc1c2CCCCc2nc2ccccc12)c1ccc(c(F)c1)-c1ccc(OCCO[N+]([O-])=O)cc1
: