Target
D-amino-acid oxidase
Ligand
BDBM50260723
Substrate
Meas. Tech.
ChEMBL_957137 (CHEMBL2378636)
Kd
26000±n/a nM
Citation
 Hopkins, SCHeffernan, MLSaraswat, LDBowen, CAMelnick, LHardy, LWOrsini, MAAllen, MSKoch, PSpear, KLFoglesong, RJSoukri, MChytil, MFang, QKJones, SWVarney, MAPanatier, AOliet, SHPollegioni, LPiubelli, LMolla, GNardini, MLarge, TH Structural, kinetic, and pharmacodynamic mechanisms of D-amino acid oxidase inhibition by small molecules. J Med Chem 56:3710-24 (2013)  
Target
Name:
D-amino-acid oxidase
Synonyms:
D-Amino Acid Oxidase (DAAO) DAMOX OXDA_PIG
Type:
Flavoprotein
Mol. Mass.:
39338.01
Organism:
Sus scrofa (pig)
Description:
Homodimer.
Residue:
347
  
Inhibitor
Name:
BDBM50260723
Synonyms:
1H-pyrrole-2-carboxylic acid CHEMBL509027 pyrrole-2-carboxylic acid
Type:
Small organic molecule
Emp. Form.:
C5H5NO2
Mol. Mass.:
111.0987
SMILES:
OC(=O)c1ccc[nH]1
: