Target
D-amino-acid oxidase
Ligand
BDBM50433371
Substrate
Meas. Tech.
ChEMBL_957001 (CHEMBL2378383)
IC50
219±n/a nM
Citation
 Hopkins, SCHeffernan, MLSaraswat, LDBowen, CAMelnick, LHardy, LWOrsini, MAAllen, MSKoch, PSpear, KLFoglesong, RJSoukri, MChytil, MFang, QKJones, SWVarney, MAPanatier, AOliet, SHPollegioni, LPiubelli, LMolla, GNardini, MLarge, TH Structural, kinetic, and pharmacodynamic mechanisms of D-amino acid oxidase inhibition by small molecules. J Med Chem 56:3710-24 (2013)  
Target
Name:
D-amino-acid oxidase
Synonyms:
D-amino-acid oxidase (DAAO) DAMOX OXDA_HUMAN
Type:
Homodimer
Mol. Mass.:
39476.06
Organism:
Homo sapiens (Human)
Description:
P14920
Residue:
347
  
Inhibitor
Name:
BDBM50433371
Synonyms:
CHEMBL2375519
Type:
Small organic molecule
Emp. Form.:
C15H13NO3
Mol. Mass.:
255.2686
SMILES:
OC(=O)c1cc2occ(CCc3ccccc3)c2[nH]1
: