Target
Chymase
Ligand
BDBM50349192
Substrate
Meas. Tech.
ChEMBL_958460 (CHEMBL2383101)
IC50
97±n/a nM
Citation
 Taylor, SJPadyana, AKAbeywardane, ALiang, SHao, MHDe Lombaert, SProudfoot, JFarmer, BSLi, XCollins, BMartin, LAlbaugh, DRHill-Drzewi, MPullen, SSTakahashi, H Discovery of potent, selective chymase inhibitors via fragment linking strategies. J Med Chem 56:4465-81 (2013)  
Target
Name:
Chymase
Synonyms:
Alpha-chymase CMA1_HUMAN CYM Mast cell protease I
Type:
Enzyme
Mol. Mass.:
27340.12
Organism:
Homo sapiens (Human)
Description:
Residue:
247
  
Inhibitor
Name:
BDBM50349192
Synonyms:
CHEMBL1807643
Type:
Small organic molecule
Emp. Form.:
C21H20N2O3S
Mol. Mass.:
380.46
SMILES:
Cc1cccc2scc(Cn3c4ccccc4n(CCCC(O)=O)c3=O)c12
: