Target
Protein mono-ADP-ribosyltransferase PARP6
Ligand
BDBM50434127
Substrate
Meas. Tech.
ChEMBL_958906 (CHEMBL2382484)
IC50
>10000±n/a nM
Citation
 Larsson, EAJansson, ANg, FMThen, SWPanicker, RLiu, BSangthongpitag, KPendharkar, VTai, SJHill, JDan, CHo, SYCheong, WWPoulsen, ABlanchard, SLin, GRAlam, JKeller, THNordlund, P Fragment-based ligand design of novel potent inhibitors of tankyrases. J Med Chem 56:4497-508 (2013)  
Target
Name:
Protein mono-ADP-ribosyltransferase PARP6
Synonyms:
ADP-ribosyltransferase diphtheria toxin-like 17 PARP-6 PARP6_HUMAN | Poly [ADP-ribose] polymerase 6
Type:
PROTEIN
Mol. Mass.:
71130.07
Organism:
Homo sapiens (Human)
Description:
ChEMBL_107589
Residue:
630
  
Inhibitor
Name:
BDBM50434127
Synonyms:
CHEMBL2381633
Type:
Small organic molecule
Emp. Form.:
C16H12FNO
Mol. Mass.:
253.271
SMILES:
Cc1cc(=O)[nH]c2cc(ccc12)-c1ccccc1F
: