Target
Free fatty acid receptor 1
Ligand
BDBM50434205
Substrate
Meas. Tech.
ChEMBL_960925 (CHEMBL2388543)
EC50
212±n/a nM
Citation
 Wang, YLiu, JJDransfield, PJZhu, LWang, ZDu, XJiao, XSu, YLi, ARBrown, SPKasparian, AVimolratana, MYu, MPattaropong, VHouze, JBSwaminath, GTran, TNguyen, KGuo, QZhang, JZhuang, RLi, FMiao, LBartberger, MDCorrell, TLChow, DWong, SLuo, JLin, DCMedina, JC Discovery and Optimization of Potent GPR40 Full Agonists Containing Tricyclic Spirocycles. ACS Med Chem Lett 4:551-5 (2013)  
Target
Name:
Free fatty acid receptor 1
Synonyms:
FFAR1 G-protein Coupled Receptor 40 | GPR40
Type:
G Protein-Coupled Receptor (GPCR)
Mol. Mass.:
31473.32
Organism:
Homo sapiens (Human)
Description:
O14842
Residue:
300
  
Inhibitor
Name:
BDBM50434205
Synonyms:
CHEMBL2385461
Type:
Small organic molecule
Emp. Form.:
C33H35FO4
Mol. Mass.:
514.627
SMILES:
COc1ccc(F)c(c1)-c1ccc(COc2ccc3CC[C@]4(C[C@H]4C(O)=O)c3c2)cc1[C@H]1CCCC1(C)C
: