Target
Nuclear receptor ROR-alpha
Ligand
BDBM50434245
Substrate
Meas. Tech.
ChEMBL_960948 (CHEMBL2388708)
EC50
8100±n/a nM
Citation
 Dubernet, MDuguet, NColliandre, LBerini, CHelleboid, SBourotte, MDaillet, MMaingot, LDaix, SDelhomel, JFMorin-Allory, LRoutier, SWalczak, R Identification of New Nonsteroidal ROR? Ligands; Related Structure-Activity Relationships and Docking Studies. ACS Med Chem Lett 4:504-8 (2013)  
Target
Name:
Nuclear receptor ROR-alpha
Synonyms:
NR1F1 Nuclear receptor subfamily 1 group F member 1 RORA RZRA | Retinoid-related orphan receptor-alpha
Type:
PROTEIN
Mol. Mass.:
58976.26
Organism:
Homo sapiens (Human)
Description:
ChEMBL_101591
Residue:
523
  
Inhibitor
Name:
BDBM50434245
Synonyms:
CHEMBL2385741
Type:
Small organic molecule
Emp. Form.:
C27H26N2O5
Mol. Mass.:
458.5057
SMILES:
CC1=NC(=O)NC(C1C(=O)OCCOc1ccccc1)c1ccc(OCc2ccccc2)cc1
: