Target
Histamine H3 receptor
Ligand
BDBM50434337
Substrate
Meas. Tech.
ChEMBL_961000 (CHEMBL2388916)
Ki
0.03±n/a nM
Citation
 Rosse, G Novel thiazolobenzodiazepines as inhibitors of histamine h3 receptor. ACS Med Chem Lett 4:435-435 (2013)  
Target
Name:
Histamine H3 receptor
Synonyms:
HH3R Hrh3
Type:
G Protein-Coupled Receptor (GPCR)
Mol. Mass.:
48607.98
Organism:
Rattus norvegicus (rat)
Description:
Residue:
445
  
Inhibitor
Name:
BDBM50434337
Synonyms:
CHEMBL2386727 | US9181275, 1
Type:
Small organic molecule
Emp. Form.:
C26H31N3O2S
Mol. Mass.:
449.608
SMILES:
CC1=C(SC2=NCc3ccccc3CN12)c1ccc(OCCCN2CCC[C@H]2CO)cc1
: