Target
Orexin receptor type 2
Ligand
BDBM50434481
Substrate
Meas. Tech.
ChEMBL_960749 (CHEMBL2390635)
IC50
2.0±n/a nM
Citation
 Wang, CMoseley, CKCarlin, SMWilson, CMNeelamegam, RHooker, JM Radiosynthesis and evaluation of [11C]EMPA as a potential PET tracer for orexin 2 receptors. Bioorg Med Chem Lett 23:3389-92 (2013)  
Target
Name:
Orexin receptor type 2
Synonyms:
HCRTR2 OX2R_HUMAN Orexin receptor type 2 (OR-2) Orexin receptor type 2 (OX2R) Ox-2-R | Ox2-R
Type:
Protein
Mol. Mass.:
50710.53
Organism:
Homo sapiens (Human)
Description:
O43614
Residue:
444
  
Inhibitor
Name:
BDBM50434481
Synonyms:
CHEMBL2385132 CHEMBL2385134
Type:
Small organic molecule
Emp. Form.:
C23H26N4O4S
Mol. Mass.:
454.542
SMILES:
CCN(Cc1cccnc1)C(=O)CN(c1ccc(OC)nc1)S(=O)(=O)c1ccccc1C
: