Target
Orexin/Hypocretin receptor type 1
Ligand
BDBM50434481
Substrate
Meas. Tech.
ChEMBL_960747 (CHEMBL2390633)
IC50
>10000±n/a nM
Citation
 Wang, CMoseley, CKCarlin, SMWilson, CMNeelamegam, RHooker, JM Radiosynthesis and evaluation of [11C]EMPA as a potential PET tracer for orexin 2 receptors. Bioorg Med Chem Lett 23:3389-92 (2013)  
Target
Name:
Orexin/Hypocretin receptor type 1
Synonyms:
HCRTR1 OX1R_HUMAN Orexin receptor type 1 (OR 1) Orexin receptor type 1 (OX1) Orexin receptor type 1 (OxR1) | Ox1r
Type:
Protein
Mol. Mass.:
47554.50
Organism:
Homo sapiens (Human)
Description:
O43613
Residue:
425
  
Inhibitor
Name:
BDBM50434481
Synonyms:
CHEMBL2385132 CHEMBL2385134
Type:
Small organic molecule
Emp. Form.:
C23H26N4O4S
Mol. Mass.:
454.542
SMILES:
CCN(Cc1cccnc1)C(=O)CN(c1ccc(OC)nc1)S(=O)(=O)c1ccccc1C
: