Target
Transient receptor potential cation channel subfamily V member 6
Ligand
BDBM50434555
Substrate
Meas. Tech.
ChEMBL_962123 (CHEMBL2388392)
IC50
159100±n/a nM
Citation
 Hofer, AKovacs, GZappatini, ALeuenberger, MHediger, MALochner, M Design, synthesis and pharmacological characterization of analogs of 2-aminoethyl diphenylborinate (2-APB), a known store-operated calcium channel blocker, for inhibition of TRPV6-mediated calcium transport. Bioorg Med Chem 21:3202-13 (2013)  
Target
Name:
Transient receptor potential cation channel subfamily V member 6
Synonyms:
CaT-L CaT1 ECAC2 TRPV6 | TRPV6_HUMAN
Type:
PROTEIN
Mol. Mass.:
87295.84
Organism:
Homo sapiens (Human)
Description:
ChEMBL_103784
Residue:
765
  
Inhibitor
Name:
BDBM50434555
Synonyms:
CHEMBL2386007
Type:
Small organic molecule
Emp. Form.:
C15H17NO
Mol. Mass.:
227.3016
SMILES:
NCCOC(c1ccccc1)c1ccccc1
: