Target
Glutamyl endopeptidase
Ligand
BDBM50435116
Substrate
Meas. Tech.
ChEMBL_965125 (CHEMBL2393667)
Ki
9950±n/a nM
Citation
 Burchacka, ESkorenski, MSienczyk, MOleksyszyn, J Phosphonic analogues of glutamic acid as irreversible inhibitors of Staphylococcus aureus endoproteinase GluC: an efficient synthesis and inhibition of the human IgG degradation. Bioorg Med Chem Lett 23:1412-5 (2013)  
Target
Name:
Glutamyl endopeptidase
Synonyms:
SSPA_STAAU | sspA
Type:
PROTEIN
Mol. Mass.:
36315.14
Organism:
Staphylococcus aureus
Description:
ChEMBL_965125
Residue:
336
  
Inhibitor
Name:
BDBM50435116
Synonyms:
CHEMBL2391724
Type:
Small organic molecule
Emp. Form.:
C31H42N3O11P
Mol. Mass.:
663.6524
SMILES:
CC(C)[C@H](NC(=O)[C@H](CCC(O)=O)NC(=O)OC(C)(C)C)C(=O)NC(CCC(O)=O)P(=O)(Oc1ccccc1)Oc1ccccc1
: