Target
Glutamyl endopeptidase
Ligand
BDBM50435121
Substrate
Meas. Tech.
ChEMBL_965125 (CHEMBL2393667)
Ki
6200±n/a nM
Citation
 Burchacka, ESkorenski, MSienczyk, MOleksyszyn, J Phosphonic analogues of glutamic acid as irreversible inhibitors of Staphylococcus aureus endoproteinase GluC: an efficient synthesis and inhibition of the human IgG degradation. Bioorg Med Chem Lett 23:1412-5 (2013)  
Target
Name:
Glutamyl endopeptidase
Synonyms:
SSPA_STAAU | sspA
Type:
PROTEIN
Mol. Mass.:
36315.14
Organism:
Staphylococcus aureus
Description:
ChEMBL_965125
Residue:
336
  
Inhibitor
Name:
BDBM50435121
Synonyms:
CHEMBL2391716
Type:
Small organic molecule
Emp. Form.:
C36H46N3O9P
Mol. Mass.:
695.7389
SMILES:
CC(C)C[C@H](NC(=O)[C@H](Cc1ccccc1)NC(=O)OC(C)(C)C)C(=O)NC(CCC(O)=O)P(=O)(Oc1ccccc1)Oc1ccccc1
: