Target
B2 bradykinin receptor
Ligand
BDBM50049949
Substrate
Meas. Tech.
ChEMBL_965476 (CHEMBL2395280)
IC50
1.8±n/a nM
Citation
 Germain, ARCarmody, LCNag, PPMorgan, BVerplank, LFernandez, CDonckele, EFeng, YPerez, JRDandapani, SPalmer, MLander, ESGupta, PBSchreiber, SLMunoz, B Cinnamides as selective small-molecule inhibitors of a cellular model of breast cancer stem cells. Bioorg Med Chem Lett 23:1834-8 (2013)  
Target
Name:
B2 bradykinin receptor
Synonyms:
B2 BRADYKININ B2R BK-2 receptor BKRB2_HUMAN | Bradykinin B2 receptor
Type:
Enzyme Catalytic Domain
Mol. Mass.:
44467.17
Organism:
Homo sapiens (Human)
Description:
B2 BRADYKININ BDKRB2 HUMAN::P30411
Residue:
391
  
Inhibitor
Name:
BDBM50049949
Synonyms:
(BK) H-Arg-Pro-Pro-Gly-Phe-Ser-Pro-Phe-Arg-OH 2-(2-{[1-(2-{2-[2-({1-[1-(2-Amino-5-guanidino-pentanoyl)-pyrrolidine-2-carbonyl]-pyrrolidine-2-carbonyl}-amino)-acetylamino]-3-phenyl-propionylamino}-3-hydroxy-propionyl)-pyrrolidine-2-carbonyl]-amino}-3-phenyl-propionylamino)-5-guanidino-pentanoic acid CHEMBL406291 | bradykinin
Type:
Small organic molecule
Emp. Form.:
C50H73N15O11
Mol. Mass.:
1060.2085
SMILES:
[#7]-[#6@@H](-[#6]-[#6]-[#6]\[#7]=[#6](/[#7])-[#7])-[#6](=O)-[#7]-1-[#6]-[#6]-[#6]-[#6@H]-1-[#6](=O)-[#7]-1-[#6]-[#6]-[#6]-[#6@H]-1-[#6](=O)-[#7]-[#6]-[#6](=O)-[#7]-[#6@@H](-[#6]-c1ccccc1)-[#6](=O)-[#7]-[#6@@H](-[#6]-[#8])-[#6](=O)-[#7]-1-[#6]-[#6]-[#6]-[#6@H]-1-[#6](=O)-[#7]-[#6@@H](-[#6]-c1ccccc1)-[#6](=O)-[#7]-[#6@@H](-[#6]-[#6]-[#6]\[#7]=[#6](/[#7])-[#7])-[#6](-[#8])=O
: