Target
Acetylcholine receptor subunit alpha/Neuronal acetylcholine receptor subunit beta-2
Ligand
BDBM50014210
Substrate
Meas. Tech.
ChEMBL_964980 (CHEMBL2396013)
Ki
>10000±n/a nM
Citation
 Arunotayanun, WDalley, JWHuang, XPSetola, VTreble, RIversen, LRoth, BLGibbons, S An analysis of the synthetic tryptamines AMT and 5-MeO-DALT: emerging 'Novel Psychoactive Drugs'. Bioorg Med Chem Lett 23:3411-5 (2013)  
Target
Name:
Acetylcholine receptor subunit alpha/Neuronal acetylcholine receptor subunit beta-2
Synonyms:
Nicotinic acetylcholine receptor alpha2/beta2
Type:
Mol. Mass.:
Description:
ASSAY_ID of ChEMBL is 964980
Components:
This complex has 2 components.
Component 1
Name:
Acetylcholine receptor subunit alpha
Synonyms:
ACHA_HUMAN Acetylcholine receptor protein alpha chain CHNRA Cholinergic, Nicotinic Alpha1Beta1DeltaGamma Nicotinic acetylcholine receptor alpha-1/beta-1 Nicotinic acetylcholine receptor alpha2/beta4 n-AChR
Type:
Ion channel
Mol. Mass.:
54542.01
Organism:
Homo sapiens (Human)
Description:
Residue:
482
  
Component 2
Name:
Neuronal acetylcholine receptor subunit beta-2
Synonyms:
ACHB2_HUMAN Neuronal acetylcholine receptor protein beta-2 subunit | Nicotinic acetylcholine receptor alpha3/beta2/alpha5
Type:
Protein
Mol. Mass.:
57020.50
Organism:
Homo sapiens (Human)
Description:
P17787
Residue:
502
  
Inhibitor
Name:
BDBM50014210
Synonyms:
1-(1H-Indol-3-yl)-2-propanamine 3-(2-Aminopropyl)indole DL-3-(2-Aminopropyl)indole alpha-Methyl-1H-indole-3-ethanamine alpha-Methyl-beta-indoleethylamine | alpha-methyltryptamine
Type:
Small organic molecule
Emp. Form.:
C11H14N2
Mol. Mass.:
174.2423
SMILES:
CC(N)Cc1c[nH]c2ccccc12
: