Target
Dual specificity protein kinase CLK2
Ligand
BDBM50435441
Substrate
Meas. Tech.
ChEMBL_965914 (CHEMBL2394345)
IC50
52±n/a nM
Citation
 Coombs, TCTanega, CShen, MWang, JLAuld, DSGerritz, SWSchoenen, FJThomas, CJAubé, J Small-molecule pyrimidine inhibitors of the cdc2-like (Clk) and dual specificity tyrosine phosphorylation-regulated (Dyrk) kinases: development of chemical probe ML315. Bioorg Med Chem Lett 23:3654-61 (2013)  
Target
Name:
Dual specificity protein kinase CLK2
Synonyms:
2.7.12.1 CDC-like kinase 2 (CLK2) CLK2 | CLK2_HUMAN
Type:
Mol. Mass.:
60128.79
Organism:
Homo sapiens (Human)
Description:
P49760
Residue:
499
  
Inhibitor
Name:
BDBM50435441
Synonyms:
CHEMBL1868723
Type:
Small organic molecule
Emp. Form.:
C18H12F3N3O2
Mol. Mass.:
359.302
SMILES:
FC(F)(F)c1cccc(Nc2nccc(n2)-c2ccc3OCOc3c2)c1
: