Target
Dual specificity protein kinase CLK4
Ligand
BDBM50435500
Substrate
Meas. Tech.
ChEMBL_965916 (CHEMBL2394347)
IC50
40±n/a nM
Citation
 Coombs, TCTanega, CShen, MWang, JLAuld, DSGerritz, SWSchoenen, FJThomas, CJAubé, J Small-molecule pyrimidine inhibitors of the cdc2-like (Clk) and dual specificity tyrosine phosphorylation-regulated (Dyrk) kinases: development of chemical probe ML315. Bioorg Med Chem Lett 23:3654-61 (2013)  
Target
Name:
Dual specificity protein kinase CLK4
Synonyms:
CDC-like kinase 4 CLK4_HUMAN | Dual specificity protein kinase CLK1/CLK4
Type:
Serine/threonine-protein kinase
Mol. Mass.:
57522.53
Organism:
Homo sapiens (Human)
Description:
gi_10190706
Residue:
481
  
Inhibitor
Name:
BDBM50435500
Synonyms:
CHEMBL1894742
Type:
Small organic molecule
Emp. Form.:
C17H14N6
Mol. Mass.:
302.3333
SMILES:
C(Nc1nccc(n1)-c1ccc2cn[nH]c2c1)c1cccnc1
: