Target
Glutaminyl-peptide cyclotransferase
Ligand
BDBM50435551
Substrate
Meas. Tech.
ChEMBL_966260 (CHEMBL2395921)
IC50
519±n/a nM
Citation
 Tran, PTHoang, VHThorat, SAKim, SEAnn, JChang, YJNam, DWSong, HMook-Jung, ILee, JLee, J Structure-activity relationship of human glutaminyl cyclase inhibitors having an N-(5-methyl-1H-imidazol-1-yl)propyl thiourea template. Bioorg Med Chem 21:3821-30 (2013)  
Target
Name:
Glutaminyl-peptide cyclotransferase
Synonyms:
Glutaminyl Cyclase Glutaminyl-peptide cyclotransferase Glutaminyl-tRNA cyclotransferase QPCT | QPCT_HUMAN
Type:
Enzyme
Mol. Mass.:
40877.05
Organism:
Homo sapiens (Human)
Description:
Q16769
Residue:
361
  
Inhibitor
Name:
BDBM50435551
Synonyms:
CHEMBL2392798
Type:
Small organic molecule
Emp. Form.:
C18H24N4OS
Mol. Mass.:
344.474
SMILES:
Cc1cncn1CCCNC(=S)Nc1ccc2C(O)CCCc2c1
: