Target
Glutaminyl-peptide cyclotransferase
Ligand
BDBM50435560
Substrate
Meas. Tech.
ChEMBL_966260 (CHEMBL2395921)
IC50
437±n/a nM
Citation
 Tran, PTHoang, VHThorat, SAKim, SEAnn, JChang, YJNam, DWSong, HMook-Jung, ILee, JLee, J Structure-activity relationship of human glutaminyl cyclase inhibitors having an N-(5-methyl-1H-imidazol-1-yl)propyl thiourea template. Bioorg Med Chem 21:3821-30 (2013)  
Target
Name:
Glutaminyl-peptide cyclotransferase
Synonyms:
Glutaminyl Cyclase Glutaminyl-peptide cyclotransferase Glutaminyl-tRNA cyclotransferase QPCT | QPCT_HUMAN
Type:
Enzyme
Mol. Mass.:
40877.05
Organism:
Homo sapiens (Human)
Description:
Q16769
Residue:
361
  
Inhibitor
Name:
BDBM50435560
Synonyms:
CHEMBL2392812
Type:
Small organic molecule
Emp. Form.:
C16H20N4OS
Mol. Mass.:
316.421
SMILES:
Cc1cncn1CCCNC(=S)Nc1ccc2OCCc2c1
: