Target
Aurora kinase A
Ligand
BDBM50435701
Substrate
Meas. Tech.
ChEMBL_965038 (CHEMBL2396200)
IC50
215±n/a nM
Citation
 Zheng, YZheng, MLing, XLiu, YXue, YAn, LGu, NJi, MJin, M Design, synthesis, quantum chemical studies and biological activity evaluation of pyrazole-benzimidazole derivatives as potent Aurora A/B kinase inhibitors. Bioorg Med Chem Lett 23:3523-30 (2013)  
Target
Name:
Aurora kinase A
Synonyms:
AIK ARK-1 AURA AURKA_HUMAN Aurora 2 Aurora kinase A (AURKA) Aurora kinase A (Aurora-2) Aurora/IPL1-related kinase 1 Breast tumor-amplified kinase IAK1 STK15 GN Serine/threonine kinase 15 Serine/threonine-protein kinase 6 Serine/threonine-protein kinase aurora-A aurora-2 | hARK1
Type:
Serine/threonine-protein kinase
Mol. Mass.:
45830.98
Organism:
Homo sapiens (Human)
Description:
O14965
Residue:
403
  
Inhibitor
Name:
BDBM50435701
Synonyms:
CHEMBL2392103
Type:
Small organic molecule
Emp. Form.:
C29H28ClN9O2S
Mol. Mass.:
602.11
SMILES:
Clc1cc(Nc2c[nH]nc2-c2nc3ccc(CN4CCOCC4)cc3[nH]2)nc(Sc2ccc(NC(=O)C3CC3)cc2)n1
: