Target
Lysine-specific demethylase 2A
Ligand
BDBM50436040
Substrate
Meas. Tech.
ChEMBL_964439 (CHEMBL2396328)
Kd
22±n/a nM
Citation
 Xu, WPodoll, JDDong, XTumber, AOppermann, UWang, X Quantitative analysis of histone demethylase probes using fluorescence polarization. J Med Chem 56:5198-202 (2013)  
Target
Name:
Lysine-specific demethylase 2A
Synonyms:
AA1-1162 F-box and leucine-rich repeat protein 11 FBL7 Homo sapiens lysine demethylase 2A (KDM2A) KDM2A KIAA1004 Lysine-specific demethylase 2A (KDM2A) | NM_012308
Type:
Enzyme Catalytic Domain
Mol. Mass.:
132809.04
Organism:
Homo sapiens (Human)
Description:
Residue:
1162
  
Inhibitor
Name:
BDBM50436040
Synonyms:
CHEMBL2392184
Type:
Small organic molecule
Emp. Form.:
C37H32N4O9S
Mol. Mass.:
708.737
SMILES:
NCc1ccc(CN(CCCCN(O)C(=O)C=CC([O-])=O)C(=S)Nc2ccc(c(c2)C([O-])=O)-c2c3ccc(O)cc3oc3cc(=O)ccc23)cc1
: