Target
D(2) dopamine receptor
Ligand
BDBM50436536
Substrate
Meas. Tech.
ChEMBL_966821 (CHEMBL2400822)
Ki
8±n/a nM
Citation
 Hiller, CKling, RCHeinemann, FWMeyer, KHübner, HGmeiner, P Functionally selective dopamine D2/D3 receptor agonists comprising an enyne moiety. J Med Chem 56:5130-41 (2013)  
Target
Name:
D(2) dopamine receptor
Synonyms:
D(2) dopamine receptor DOPAMINE D2 Long DRD2 Dopamine D2 receptor Dopamine D2 receptor (D2R) Dopamine2-like | d2
Type:
Cell-surface receptors
Mol. Mass.:
50647.10
Organism:
Homo sapiens (Human)
Description:
P14416
Residue:
443
  
Inhibitor
Name:
BDBM50436536
Synonyms:
CHEMBL2397477
Type:
Small organic molecule
Emp. Form.:
C32H47N5O3
Mol. Mass.:
549.7473
SMILES:
CCCCn1ncc(CCCOc2ccc(cc2OC)C(=O)NCCCCN(CCC)[C@@H]2CCC(=CC2)C#C)n1
: