Target
E3 ubiquitin-protein ligase Mdm2
Ligand
BDBM50436686
Substrate
Meas. Tech.
ChEMBL_967970 (CHEMBL2401074)
Ki
0.940000±n/a nM
Citation
 Zhao, YYu, SSun, WLiu, LLu, JMcEachern, DShargary, SBernard, DLi, XZhao, TZou, PSun, DWang, S A potent small-molecule inhibitor of the MDM2-p53 interaction (MI-888) achieved complete and durable tumor regression in mice. J Med Chem 56:5553-61 (2014)  
Target
Name:
E3 ubiquitin-protein ligase Mdm2
Synonyms:
Double minute 2 protein E3 ubiquitin-protein ligase Mdm2 (p53-binding protein Mdm2) Human Double Minute 2 (HDM2) MDM2-MDMX p53-Binding Protein MDM2 | p53-binding protein
Type:
Oncoprotein
Mol. Mass.:
55196.54
Organism:
Homo sapiens (Human)
Description:
Q00987
Residue:
491
  
Inhibitor
Name:
BDBM50436686
Synonyms:
CHEMBL2398475
Type:
Small organic molecule
Emp. Form.:
C28H32Cl2FN3O3
Mol. Mass.:
548.476
SMILES:
CC(C)(C)C[C@@H]1N[C@H]([C@H](c2cccc(Cl)c2F)[C@]11C(=O)Nc2cc(Cl)ccc12)C(=O)N[C@H]1CC[C@@H](O)C1
: