Target
E3 ubiquitin-protein ligase XIAP
Ligand
BDBM44289
Substrate
Meas. Tech.
ChEMBL_971509 (CHEMBL2406571)
Ki
640±n/a nM
Citation
 Ardecky, RJWelsh, KFinlay, DLee, PSGonzález-López, MGanji, SRRavanan, PMace, PDRiedl, SJVuori, KReed, JCCosford, ND Design, synthesis and evaluation of inhibitor of apoptosis protein (IAP) antagonists that are highly selective for the BIR2 domain of XIAP. Bioorg Med Chem Lett 23:4253-7 (2013)  
Target
Name:
E3 ubiquitin-protein ligase XIAP
Synonyms:
API3 E3 ubiquitin-protein ligase XIAP Inhibitor of apoptosis protein 3 X-linked inhibitor of apoptosis XIAP | XIAP_HUMAN
Type:
Protein
Mol. Mass.:
56685.27
Organism:
Homo sapiens (Human)
Description:
P98170
Residue:
497
  
Inhibitor
Name:
BDBM44289
Synonyms:
(2S)-2-[[(2S)-2-amino-1-oxopropyl]amino]-3-methyl-N-[(2S)-1-(1-naphthalenylamino)-1-oxopropan-2-yl]butanamide;formic acid (2S)-2-[[(2S)-2-aminopropanoyl]amino]-N-[(1S)-2-keto-1-methyl-2-(1-naphthylamino)ethyl]-3-methyl-butyramide;formic acid CHEMBL1617615 cid_44176346
Type:
Small organic molecule
Emp. Form.:
C21H28N4O3
Mol. Mass.:
384.472
SMILES:
CC(C)[C@H](NC(=O)[C@H](C)N)C(=O)N[C@@H](C)C(=O)Nc1cccc2ccccc12
: