Target
E3 ubiquitin-protein ligase XIAP
Ligand
BDBM44327
Substrate
Meas. Tech.
ChEMBL_971509 (CHEMBL2406571)
Ki
1700±n/a nM
Citation
 Ardecky, RJWelsh, KFinlay, DLee, PSGonzález-López, MGanji, SRRavanan, PMace, PDRiedl, SJVuori, KReed, JCCosford, ND Design, synthesis and evaluation of inhibitor of apoptosis protein (IAP) antagonists that are highly selective for the BIR2 domain of XIAP. Bioorg Med Chem Lett 23:4253-7 (2013)  
Target
Name:
E3 ubiquitin-protein ligase XIAP
Synonyms:
API3 E3 ubiquitin-protein ligase XIAP Inhibitor of apoptosis protein 3 X-linked inhibitor of apoptosis XIAP | XIAP_HUMAN
Type:
Protein
Mol. Mass.:
56685.27
Organism:
Homo sapiens (Human)
Description:
P98170
Residue:
497
  
Inhibitor
Name:
BDBM44327
Synonyms:
CHEMBL1618815 benzyl N-[(4S)-4-[[(2S)-3-methyl-2-[[(2S)-2-(methylamino)propanoyl]amino]butanoyl]amino]-5-oxo-5-(2-phenylhydrazinyl)pentyl]carbamate;formic acid formic acid;N-[(4S)-4-[[(2S)-3-methyl-2-[[(2S)-2-(methylamino)-1-oxopropyl]amino]-1-oxobutyl]amino]-5-oxo-5-(phenylhydrazo)pentyl]carbamic acid (phenylmethyl) ester methanoic acid;(phenylmethyl) N-[(4S)-4-[[(2S)-3-methyl-2-[[(2S)-2-(methylamino)propanoyl]amino]butanoyl]amino]-5-oxidanylidene-5-(2-phenylhydrazinyl)pentyl]carbamate
Type:
Small organic molecule
Emp. Form.:
C28H40N6O5
Mol. Mass.:
540.6544
SMILES:
CN[C@@H](C)C(=O)N[C@@H](C(C)C)C(=O)N[C@@H](CCCNC(=O)OCc1ccccc1)C(=O)NNc1ccccc1
: