Target
E3 ubiquitin-protein ligase XIAP
Ligand
BDBM44331
Substrate
Meas. Tech.
ChEMBL_971508 (CHEMBL2406570)
Ki
>39000±n/a nM
Citation
 Ardecky, RJWelsh, KFinlay, DLee, PSGonzález-López, MGanji, SRRavanan, PMace, PDRiedl, SJVuori, KReed, JCCosford, ND Design, synthesis and evaluation of inhibitor of apoptosis protein (IAP) antagonists that are highly selective for the BIR2 domain of XIAP. Bioorg Med Chem Lett 23:4253-7 (2013)  
Target
Name:
E3 ubiquitin-protein ligase XIAP
Synonyms:
API3 E3 ubiquitin-protein ligase XIAP Inhibitor of apoptosis protein 3 X-linked inhibitor of apoptosis XIAP | XIAP_HUMAN
Type:
Protein
Mol. Mass.:
56685.27
Organism:
Homo sapiens (Human)
Description:
P98170
Residue:
497
  
Inhibitor
Name:
BDBM44331
Synonyms:
CHEMBL1620115 cid_44182255 formic acid;(2S)-N-[(2S)-3-hydroxy-1-oxo-1-(2-phenylhydrazinyl)propan-2-yl]-3-methyl-2-[[(2S)-2-(methylamino)propanoyl]amino]butanamide methanoic acid;(2S)-3-methyl-2-[[(2S)-2-(methylamino)propanoyl]amino]-N-[(2S)-3-oxidanyl-1-oxidanylidene-1-(2-phenylhydrazinyl)propan-2-yl]butanamide
Type:
Small organic molecule
Emp. Form.:
C18H29N5O4
Mol. Mass.:
379.454
SMILES:
CN[C@@H](C)C(=O)N[C@@H](C(C)C)C(=O)N[C@@H](CO)C(=O)NNc1ccccc1
: