Target
E3 ubiquitin-protein ligase XIAP
Ligand
BDBM44310
Substrate
Meas. Tech.
ChEMBL_971508 (CHEMBL2406570)
Ki
34180±n/a nM
Citation
 Ardecky, RJWelsh, KFinlay, DLee, PSGonzález-López, MGanji, SRRavanan, PMace, PDRiedl, SJVuori, KReed, JCCosford, ND Design, synthesis and evaluation of inhibitor of apoptosis protein (IAP) antagonists that are highly selective for the BIR2 domain of XIAP. Bioorg Med Chem Lett 23:4253-7 (2013)  
Target
Name:
E3 ubiquitin-protein ligase XIAP
Synonyms:
API3 E3 ubiquitin-protein ligase XIAP Inhibitor of apoptosis protein 3 X-linked inhibitor of apoptosis XIAP | XIAP_HUMAN
Type:
Protein
Mol. Mass.:
56685.27
Organism:
Homo sapiens (Human)
Description:
P98170
Residue:
497
  
Inhibitor
Name:
BDBM44310
Synonyms:
CHEMBL1621070 cid_44182203 formic acid;(2S)-3-methyl-2-[[(2S)-2-(methylamino)propanoyl]amino]-N-[(2S)-1-(naphthalen-1-ylmethylamino)-1-oxopropan-2-yl]butanamide methanoic acid;(2S)-3-methyl-2-[[(2S)-2-(methylamino)propanoyl]amino]-N-[(2S)-1-(naphthalen-1-ylmethylamino)-1-oxidanylidene-propan-2-yl]butanamide
Type:
Small organic molecule
Emp. Form.:
C23H32N4O3
Mol. Mass.:
412.5252
SMILES:
CN[C@@H](C)C(=O)N[C@@H](C(C)C)C(=O)N[C@@H](C)C(=O)NCc1cccc2ccccc12
: