Target
Isocitrate lyase
Ligand
BDBM50402852
Substrate
Meas. Tech.
ChEMBL_972063 (CHEMBL2406167)
IC50
48800±n/a nM
Citation
 Ahn, CHWon, THKim, HShin, JOh, KB Inhibition of Candida albicans isocitrate lyase activity by cadiolides and synoilides from the ascidian Synoicum sp. Bioorg Med Chem Lett 23:4099-101 (2013)  
Target
Name:
Isocitrate lyase
Synonyms:
ACEA_CANAX | ICL1
Type:
PROTEIN
Mol. Mass.:
61398.95
Organism:
Candida albicans
Description:
ChEMBL_972063
Residue:
550
  
Inhibitor
Name:
BDBM50402852
Synonyms:
CHEMBL2204155
Type:
Small organic molecule
Emp. Form.:
C25H16Br4O6
Mol. Mass.:
732.007
SMILES:
COc1c(Br)cc(cc1Br)[C@H](O)C1=C(\C(OC1=O)=C\c1ccc(O)c(Br)c1)c1ccc(O)c(Br)c1
: