Target
Insulin-like growth factor 1 receptor
Ligand
BDBM50437357
Substrate
Meas. Tech.
ChEMBL_972569 (CHEMBL2410391)
IC50
0.600000±n/a nM
Citation
 Jin, MPetronella, BACooke, AKadalbajoo, MSiu, KWKleinberg, AMay, EWGokhale, PCSchulz, RKahler, JBittner, MAForeman, KPachter, JAWild, REpstein, DMulvihill, MJ Discovery of novel insulin-like growth factor-1 receptor inhibitors with unique time-dependent binding kinetics. ACS Med Chem Lett 4:627-31 (2013)  
Target
Name:
Insulin-like growth factor 1 receptor
Synonyms:
CD_antigen=CD221 IGF1R Insulin-like growth factor 1 receptor (IGF1R) Insulin-like growth factor 1 receptor alpha chain Insulin-like growth factor I receptor | Insulin-like growth factor receptor (IGFR)
Type:
Protein
Mol. Mass.:
154776.79
Organism:
Homo sapiens (Human)
Description:
P08069
Residue:
1367
  
Inhibitor
Name:
BDBM50437357
Synonyms:
CHEMBL3037909
Type:
Small organic molecule
Emp. Form.:
C28H27N5O2
Mol. Mass.:
465.5463
SMILES:
CCOc1cc(nc2cc(ccc12)-c1nc([C@H]2C[C@@](C)(O)C2)n2ccnc(N)c12)-c1ccccc1
: