Target
G-protein coupled bile acid receptor 1
Ligand
BDBM50437872
Substrate
Meas. Tech.
ChEMBL_974031 (CHEMBL2410509)
EC50
3000±n/a nM
Citation
 Dehmlow, HAlvarez Sánchez, RBachmann, SBissantz, CBliss, FConde-Knape, KGraf, MMartin, REObst Sander, URaab, SRichter, HGSewing, SSprecher, UUllmer, CMattei, P Discovery and optimisation of 1-hydroxyimino-3,3-diphenylpropanes, a new class of orally active GPBAR1 (TGR5) agonists. Bioorg Med Chem Lett 23:4627-32 (2013)  
Target
Name:
G-protein coupled bile acid receptor 1
Synonyms:
GPBAR_MOUSE M-BAR Tgr5
Type:
PROTEIN
Mol. Mass.:
35665.78
Organism:
Mus musculus
Description:
ChEMBL_1475560
Residue:
329
  
Inhibitor
Name:
BDBM50437872
Synonyms:
CHEMBL2407935
Type:
Small organic molecule
Emp. Form.:
C23H24N2O4S
Mol. Mass.:
424.513
SMILES:
Cc1ccccc1[C@@H](CC(N=O)c1ccc(=O)n(C)c1)c1ccc(cc1)S(C)(=O)=O
: