Target
G-protein coupled bile acid receptor 1
Ligand
BDBM50437878
Substrate
Meas. Tech.
ChEMBL_974031 (CHEMBL2410509)
EC50
190±n/a nM
Citation
 Dehmlow, HAlvarez Sánchez, RBachmann, SBissantz, CBliss, FConde-Knape, KGraf, MMartin, REObst Sander, URaab, SRichter, HGSewing, SSprecher, UUllmer, CMattei, P Discovery and optimisation of 1-hydroxyimino-3,3-diphenylpropanes, a new class of orally active GPBAR1 (TGR5) agonists. Bioorg Med Chem Lett 23:4627-32 (2013)  
Target
Name:
G-protein coupled bile acid receptor 1
Synonyms:
GPBAR_MOUSE M-BAR Tgr5
Type:
PROTEIN
Mol. Mass.:
35665.78
Organism:
Mus musculus
Description:
ChEMBL_1475560
Residue:
329
  
Inhibitor
Name:
BDBM50437878
Synonyms:
CHEMBL2407929
Type:
Small organic molecule
Emp. Form.:
C29H26N2O3
Mol. Mass.:
450.5283
SMILES:
Cc1cc(ccn1)C(C[C@@H](c1ccc(cc1)-c1ccc(cc1)C(O)=O)c1ccccc1C)N=O
: