Target
G-protein coupled bile acid receptor 1
Ligand
BDBM50437880
Substrate
Meas. Tech.
ChEMBL_974032 (CHEMBL2410510)
EC50
290±n/a nM
Citation
 Dehmlow, HAlvarez Sánchez, RBachmann, SBissantz, CBliss, FConde-Knape, KGraf, MMartin, REObst Sander, URaab, SRichter, HGSewing, SSprecher, UUllmer, CMattei, P Discovery and optimisation of 1-hydroxyimino-3,3-diphenylpropanes, a new class of orally active GPBAR1 (TGR5) agonists. Bioorg Med Chem Lett 23:4627-32 (2013)  
Target
Name:
G-protein coupled bile acid receptor 1
Synonyms:
BG37 GPBAR_HUMAN TGR5 hGPCR19
Type:
G Protein-Coupled Receptor (GPCR)
Mol. Mass.:
35260.02
Organism:
Homo sapiens (Human)
Description:
CHO cells transiently transfected with hTGR5.
Residue:
330
  
Inhibitor
Name:
BDBM50437880
Synonyms:
CHEMBL2407955
Type:
Small organic molecule
Emp. Form.:
C29H26N2O3
Mol. Mass.:
450.5283
SMILES:
Cc1cc(ccn1)C(CC(c1ccc(cc1)-c1cccc(c1)C(O)=O)c1ccccc1C)N=O
: